Target
Glucocorticoid receptor
Ligand
BDBM50144159
Substrate
Meas. Tech.
ChEBML_71109
IC50
21±n/a nM
Citation
 Akritopoulou-Zanze, IPatel, JRHartandi, KBrenneman, JWinn, MPratt, JKGrynfarb, MGoos-Nisson, AVon Geldern, TWKym, PR Synthesis and biological evaluation of novel, selective, nonsteroidal glucocorticoid receptor antagonists. Bioorg Med Chem Lett 14:2079-82 (2004)  
Target
Name:
Glucocorticoid receptor
Synonyms:
GCR_HUMAN GRL Glucocorticoid receptor (GRFP) Nuclear receptor subfamily 3 group C member 1
Type:
Enzyme
Mol. Mass.:
85656.87
Organism:
Homo sapiens (Human)
Description:
P04150
Residue:
777
  
Inhibitor
Name:
BDBM50144159
Synonyms:
CHEMBL294800 | N-(1-Methoxy-6-m-tolyl-6H-benzo[c]chromen-8-yl)-methanesulfonamide
Type:
Small organic molecule
Emp. Form.:
C22H21NO4S
Mol. Mass.:
395.471
SMILES:
COc1cccc2OC(c3cccc(C)c3)c3cc(NS(C)(=O)=O)ccc3-c12
: