Target
Alpha-2A adrenergic receptor
Ligand
BDBM50027031
Substrate
Meas. Tech.
ChEMBL_33034 (CHEMBL648049)
Ki
55±n/a nM
Citation
 Saari, WSHalczenko, WRandall, WCLotti, VJ alpha-Adrenergic activities of some substituted 2-(aminomethyl)imidazolines. J Med Chem 26:1769-72 (1984)  
Target
Name:
Alpha-2A adrenergic receptor
Synonyms:
ADA2A_BOVIN Alpha-2A adrenergic receptor Alpha-2A adrenoreceptor Alpha-2D adrenergic receptor Cerebral cortex alpha adrenergic receptor adrenergic Alpha2D
Type:
Enzyme Catalytic Domain
Mol. Mass.:
49275.13
Organism:
BOVINE
Description:
adrenergic Alpha2 0 BOVINE::Q28838
Residue:
452
  
Inhibitor
Name:
BDBM50027031
Synonyms:
(2-Chloro-phenyl)-(4,5-dihydro-1H-imidazol-2-ylmethyl)-amine | CHEMBL51358
Type:
Small organic molecule
Emp. Form.:
C10H12ClN3
Mol. Mass.:
209.675
SMILES:
Clc1ccccc1NCC1=NCCN1
: