Target
Alpha-2A adrenergic receptor
Ligand
BDBM50027036
Substrate
Meas. Tech.
ChEMBL_33033 (CHEMBL643958)
Ki
3.3±n/a nM
Citation
 Saari, WSHalczenko, WRandall, WCLotti, VJ alpha-Adrenergic activities of some substituted 2-(aminomethyl)imidazolines. J Med Chem 26:1769-72 (1984)  
Target
Name:
Alpha-2A adrenergic receptor
Synonyms:
ADA2A_BOVIN Alpha-2A adrenergic receptor Alpha-2A adrenoreceptor Alpha-2D adrenergic receptor Cerebral cortex alpha adrenergic receptor adrenergic Alpha2D
Type:
Enzyme Catalytic Domain
Mol. Mass.:
49275.13
Organism:
BOVINE
Description:
adrenergic Alpha2 0 BOVINE::Q28838
Residue:
452
  
Inhibitor
Name:
BDBM50027036
Synonyms:
(4,5-Dihydro-1H-imidazol-2-ylmethyl)-methyl-p-tolyl-amine | CHEMBL300628
Type:
Small organic molecule
Emp. Form.:
C12H17N3
Mol. Mass.:
203.2835
SMILES:
CN(CC1=NCCN1)c1ccc(C)cc1
: