Target
Alpha-2A adrenergic receptor
Ligand
BDBM50027035
Substrate
Meas. Tech.
ChEBML_33034
Ki
380±n/a nM
Citation
 Saari, WSHalczenko, WRandall, WCLotti, VJ alpha-Adrenergic activities of some substituted 2-(aminomethyl)imidazolines. J Med Chem 26:1769-72 (1984)  
Target
Name:
Alpha-2A adrenergic receptor
Synonyms:
ADA2A_BOVIN Alpha-2A adrenergic receptor Alpha-2A adrenoreceptor Alpha-2D adrenergic receptor Cerebral cortex alpha adrenergic receptor adrenergic Alpha2D
Type:
Enzyme Catalytic Domain
Mol. Mass.:
49275.13
Organism:
BOVINE
Description:
adrenergic Alpha2 0 BOVINE::Q28838
Residue:
452
  
Inhibitor
Name:
BDBM50027035
Synonyms:
3-[(4,5-Dihydro-1H-imidazol-2-ylmethyl)-amino]-phenol | CHEMBL51479
Type:
Small organic molecule
Emp. Form.:
C10H13N3O
Mol. Mass.:
191.2297
SMILES:
Oc1cccc(NCC2=NCCN2)c1
: