Target
Aminopeptidase N
Ligand
BDBM50046325
Substrate
Meas. Tech.
ChEMBL_35362 (CHEMBL647944)
Ki
500000±n/a nM
Citation
 Rich, DHMoon, BJHarbeson, S Inhibition of aminopeptidases by amastatin and bestatin derivatives. Effect of inhibitor structure on slow-binding processes. J Med Chem 27:417-22 (1984)  
Target
Name:
Aminopeptidase N
Synonyms:
AMPN_PIG AP-M Alanyl aminopeptidase Aminopeptidase N (APN) Microsomal aminopeptidase pAPN
Type:
Protein
Mol. Mass.:
108810.25
Organism:
Sus scrofa (Pig)
Description:
P15145
Residue:
963
  
Inhibitor
Name:
BDBM50046325
Synonyms:
(S)-2-((2S,3S)-3-Amino-2-hydroxy-4-phenyl-butyrylamino)-4-methyl-pentanoic acid CHEMBL70878
Type:
Small organic molecule
Emp. Form.:
C16H24N2O4
Mol. Mass.:
308.3728
SMILES:
CC(C)C[C@H](NC(=O)[C@@H](O)[C@@H](N)Cc1ccccc1)C(O)=O
: