Target
Xanthine dehydrogenase/oxidase
Ligand
BDBM50028121
Substrate
Meas. Tech.
ChEBML_216940
Ki
3000±n/a nM
Citation
 Seela, FBussmann, WGötze, ARosemeyer, H Isomeric N-methyl-7-deazaguanines: synthesis, structural assignment, and inhibitory activity on xanthine oxidase. J Med Chem 27:981-5 (1984)  
Target
Name:
Xanthine dehydrogenase/oxidase
Synonyms:
XDH Xanthine dehydrogenase Xanthine oxidase (XO)
Type:
Protein
Mol. Mass.:
146809.00
Organism:
Bos taurus (Bovine)
Description:
P80457
Residue:
1332
  
Inhibitor
Name:
BDBM50028121
Synonyms:
2-Amino-7-methyl-4a,7-dihydro-pyrrolo[2,3-d]pyrimidin-4-one | CHEMBL177888
Type:
Small organic molecule
Emp. Form.:
C7H8N4O
Mol. Mass.:
164.1646
SMILES:
Cn1ccc2c1nc(N)[nH]c2=O
: