Target
Transporter
Ligand
BDBM50021230
Substrate
Meas. Tech.
ChEBML_176350
IC50
0.320±n/a nM
Citation
 Bøgesø, KPChristensen, AVHyttel, JLiljefors, T 3-Phenyl-1-indanamines. Potential antidepressant activity and potent inhibition of dopamine, norepinephrine, and serotonin uptake. J Med Chem 28:1817-28 (1986)  
Target
Name:
Transporter
Synonyms:
Monoamine transporters; Norepininephrine & dopamine | Norepinephrine Monoamine transporters
Type:
PROTEIN
Mol. Mass.:
66787.87
Organism:
Rattus norvegicus
Description:
ChEMBL_1463061
Residue:
597
  
Inhibitor
Name:
BDBM50021230
Synonyms:
CHEMBL545201 | [3-(3,4-Dichloro-phenyl)-indan-1-yl]-ethyl-amine; hydrochloride
Type:
Small organic molecule
Emp. Form.:
C17H17Cl2N
Mol. Mass.:
306.23
SMILES:
CCNC1CC(c2ccccc12)c1ccc(Cl)c(Cl)c1
: