Target
cGMP-inhibited 3',5'-cyclic phosphodiesterase 3A/3B
Ligand
BDBM50225504
Substrate
Meas. Tech.
ChEMBL_155702 (CHEMBL766279)
Ki
12000±n/a nM
Citation
 Weishaar, RECain, MHBristol, JA A new generation of phosphodiesterase inhibitors: multiple molecular forms of phosphodiesterase and the potential for drug selectivity. J Med Chem 28:537-45 (1985)  
Target
Name:
cGMP-inhibited 3',5'-cyclic phosphodiesterase 3A/3B
Synonyms:
Phosphodiesterase (PDE3) Phosphodiesterase 3 (PDE3) | cGMP-inhibited 3',5'-cyclic phosphodiesterase A/B
Type:
Mol. Mass.:
Description:
ASSAY_ID of ChEMBL is 156458
Components:
This complex has 2 components.
Component 1
Name:
cGMP-inhibited 3',5'-cyclic phosphodiesterase 3B
Synonyms:
CGI-PDE B CGIPDE1 PDE3B Phosphodiesterase 3B Phosphodiesterase Type 3 (PDE3B) cGMP-inhibited 3,5-cyclic phosphodiesterase B
Type:
Enzyme
Mol. Mass.:
124318.95
Organism:
Homo sapiens (Human)
Description:
PDE3B was generated from the full-length recombinant human clone transfected into Sf9 cells.
Residue:
1112
  
Component 2
Name:
cGMP-inhibited 3',5'-cyclic phosphodiesterase 3A
Synonyms:
3',5'-cyclic phosphodiesterase Cyclic GMP-inhibited phosphodiesterase A PDE3A_HUMAN Phosphodiesterase 3 (PDE3) Phosphodiesterase 3A Phosphodiesterase 3A (PDE3A1) cGMP-inhibited 3',5'-cyclic phosphodiesterase A | cGMP-inhibited 3,5-cyclic phosphodiesterase A
Type:
Enzyme
Mol. Mass.:
124966.46
Organism:
Homo sapiens (Human)
Description:
Q14432
Residue:
1141
  
Inhibitor
Name:
BDBM50225504
Synonyms:
EHT-0202 SQ-20009
Type:
Small organic molecule
Emp. Form.:
C14H19N5O2
Mol. Mass.:
289.333
SMILES:
[#6]-[#6]-[#8]-[#6](=O)-c1cnc2n(-[#6]-[#6])ncc2c1-[#7]\[#7]=[#6](\[#6])-[#6]
: