Target
Adenosine receptor A1
Ligand
BDBM50020967
Substrate
Meas. Tech.
ChEMBL_28521 (CHEMBL642860)
IC50
70±n/a nM
Citation
 Hamilton, HWOrtwine, DFWorth, DFBadger, EWBristol, JABruns, RFHaleen, SJSteffen, RP Synthesis of xanthines as adenosine antagonists, a practical quantitative structure-activity relationship application. J Med Chem 28:1071-9 (1985)  
Target
Name:
Adenosine receptor A1
Synonyms:
AA1R_RAT ADENOSINE A1 high Adenosine A1 receptor (A1) Adenosine receptors A1 | Adora1
Type:
Protein
Mol. Mass.:
36704.13
Organism:
Rattus norvegicus (rat)
Description:
Residue:
326
  
Inhibitor
Name:
BDBM50020967
Synonyms:
4-(1,3-Diethyl-2,6-dioxo-2,3,6,7-tetrahydro-1H-purin-8-yl)-N-(3-dimethylamino-propyl)-benzenesulfonamide | CHEMBL10913
Type:
Small organic molecule
Emp. Form.:
C20H28N6O4S
Mol. Mass.:
448.539
SMILES:
CCn1c2nc([nH]c2c(=O)n(CC)c1=O)-c1ccc(cc1)S(=O)(=O)NCCCN(C)C
: