Target
3-oxo-5-alpha-steroid 4-dehydrogenase 1/2
Ligand
BDBM50025455
Substrate
Meas. Tech.
ChEMBL_204598 (CHEMBL813360)
IC50
6.3±n/a nM
Citation
 Rasmusson, GHReynolds, GFSteinberg, NGWalton, EPatel, GFLiang, TCascieri, MACheung, AHBrooks, JRBerman, C Azasteroids: structure-activity relationships for inhibition of 5 alpha-reductase and of androgen receptor binding. J Med Chem 29:2298-315 (1986)  
Target
Name:
3-oxo-5-alpha-steroid 4-dehydrogenase 1/2
Synonyms:
Steroid 5-alpha-reductase
Type:
Mol. Mass.:
Description:
ASSAY_ID of ChEMBL is 204723
Components:
This complex has 2 components.
Component 1
Name:
3-oxo-5-alpha-steroid 4-dehydrogenase 1
Synonyms:
S5A1_RAT Steroid 5-alpha-reductase | Steroid 5-alpha-reductase 1
Type:
PROTEIN
Mol. Mass.:
29788.29
Organism:
Rattus norvegicus
Description:
ChEMBL_1441437
Residue:
259
  
Component 2
Name:
3-oxo-5-alpha-steroid 4-dehydrogenase 2
Synonyms:
S5A2_RAT Steroid 5-alpha-reductase | Steroid 5-alpha-reductase 2
Type:
PROTEIN
Mol. Mass.:
28784.15
Organism:
Rattus norvegicus
Description:
ChEMBL_205054
Residue:
254
  
Inhibitor
Name:
BDBM50025455
Synonyms:
4a,6a-Dimethyl-2-oxo-hexadecahydro-indeno[5,4-f]quinoline-7-carboxylic acid tert-butylamide | CHEMBL3349168
Type:
Small organic molecule
Emp. Form.:
C23H38N2O2
Mol. Mass.:
374.56
SMILES:
[H][C@@]12CC[C@H](C(=O)NC(C)(C)C)[C@@]1(C)CC[C@@]1([H])[C@@]2([H])CCC2NC(=O)CC[C@]12C
: