Target
Androgen receptor
Ligand
BDBM50025351
Substrate
Meas. Tech.
ChEBML_36310
IC50
15±n/a nM
Citation
 Rasmusson, GHReynolds, GFSteinberg, NGWalton, EPatel, GFLiang, TCascieri, MACheung, AHBrooks, JRBerman, C Azasteroids: structure-activity relationships for inhibition of 5 alpha-reductase and of androgen receptor binding. J Med Chem 29:2298-315 (1986)  
Target
Name:
Androgen receptor
Synonyms:
ANDR_RAT Ar Nr3c4 | androgen
Type:
Enzyme
Mol. Mass.:
98219.08
Organism:
Rattus norvegicus (Rat)
Description:
P15207
Residue:
902
  
Inhibitor
Name:
BDBM50025351
Synonyms:
1,4a,6a-Trimethyl-7-(1H-pyrrole-2-carbonyl)-1,4a,4b,5,6,6a,7,8,9,9a,9b,10,11,11a-tetradecahydro-indeno[5,4-f]quinolin-2-one | CHEMBL3349148
Type:
Small organic molecule
Emp. Form.:
C24H32N2O2
Mol. Mass.:
380.5231
SMILES:
[H][C@@]12CC[C@H](C(=O)c3ccc[nH]3)[C@@]1(C)CC[C@@]1([H])[C@@]2([H])CCC2N(C)C(=O)C=C[C@]12C
: