Target
Histamine H1 receptor
Ligand
BDBM50019631
Substrate
Meas. Tech.
ChEBML_75330
IC50
16±n/a nM
Citation
 Iemura, RKawashima, TFukuda, TIto, KTsukamoto, G Synthesis of 2-(4-substituted-1-piperazinyl)benzimidazoles as H1-antihistaminic agents. J Med Chem 29:1178-83 (1987)  
Target
Name:
Histamine H1 receptor
Synonyms:
HISTAMINE H1 HRH1_CAVPO
Type:
G Protein-Coupled Receptor (GPCR)
Mol. Mass.:
55641.53
Organism:
Cavia porcellus (domestic guinea pig)
Description:
Guinea pig cerebellum was used in binding assay.
Residue:
488
  
Inhibitor
Name:
BDBM50019631
Synonyms:
1-(2-Ethoxy-ethyl)-2-(4-propyl-piperazin-1-yl)-1H-benzoimidazole | CHEMBL18151
Type:
Small organic molecule
Emp. Form.:
C18H28N4O
Mol. Mass.:
316.4411
SMILES:
CCCN1CCN(CC1)c1nc2ccccc2n1CCOCC
: