Target
D(2) dopamine receptor
Ligand
BDBM50018648
Substrate
Meas. Tech.
ChEBML_61412
IC50
13000±n/a nM
Citation
 Wikström, HAndersson, BElebring, TSvensson, KCarlsson, ALargent, B N-substituted 1,2,3,4,4a,5,6,10b-octahydrobenzo[f]quinolines and 3-phenylpiperidines: effects on central dopamine and sigma receptors. J Med Chem 30:2169-74 (1988)  
Target
Name:
D(2) dopamine receptor
Synonyms:
DOPAMINE D2 DOPAMINE D2 Short Dopamine D2 receptor Drd2
Type:
G Protein-Coupled Receptor (GPCR)
Mol. Mass.:
50931.60
Organism:
Rattus norvegicus (rat)
Description:
P61169
Residue:
444
  
Inhibitor
Name:
BDBM50018648
Synonyms:
4-(1-Propyl-piperidin-3-yl)-phenol | CHEMBL305438
Type:
Small organic molecule
Emp. Form.:
C14H21NO
Mol. Mass.:
219.3226
SMILES:
CCCN1CCCC(C1)c1ccc(O)cc1
: