Target
Sigma non-opioid intracellular receptor 1
Ligand
BDBM50018648
Substrate
Meas. Tech.
ChEBML_226561
IC50
276±n/a nM
Citation
 Wikström, HAndersson, BElebring, TSvensson, KCarlsson, ALargent, B N-substituted 1,2,3,4,4a,5,6,10b-octahydrobenzo[f]quinolines and 3-phenylpiperidines: effects on central dopamine and sigma receptors. J Med Chem 30:2169-74 (1988)  
Target
Name:
Sigma non-opioid intracellular receptor 1
Synonyms:
Opioid receptor SGMR1_RAT Sigma non-opioid intracellular receptor 1 Sigma-1 | Sigmar1
Type:
Enzyme Catalytic Domain
Mol. Mass.:
25266.54
Organism:
RAT
Description:
Q9R0C9
Residue:
223
  
Inhibitor
Name:
BDBM50018648
Synonyms:
4-(1-Propyl-piperidin-3-yl)-phenol | CHEMBL305438
Type:
Small organic molecule
Emp. Form.:
C14H21NO
Mol. Mass.:
219.3226
SMILES:
CCCN1CCCC(C1)c1ccc(O)cc1
: