Target
Renin
Ligand
BDBM50367481
Substrate
Meas. Tech.
ChEBML_195751
IC50
2±n/a nM
Citation
 Thaisrivongs, SPals, DTLawson, JATurner, SRHarris, DW alpha-Methylproline-containing renin inhibitory peptides: in vivo evaluation in an anesthetized, ganglion-blocked, hog renin infused rat model. J Med Chem 30:536-41 (1987)  
Target
Name:
Renin
Synonyms:
Angiotensinogenase RENI_HUMAN
Type:
Enzyme
Mol. Mass.:
45058.99
Organism:
Homo sapiens (Human)
Description:
Residue:
406
  
Inhibitor
Name:
BDBM50367481
Synonyms:
CHEMBL1237141 | CHEMBL3143428
Type:
Small organic molecule
Emp. Form.:
C50H76N10O8
Mol. Mass.:
945.2006
SMILES:
CC[C@H](C)[C@H](NC(=O)[C@@H](NC[C@H](O)[C@H](CC(C)C)NC(=O)[C@H](Cc1c[nH]cn1)NC(=O)[C@H](Cc1ccccc1)NC(=O)[C@]1(C)CCCN1C(=O)OC(C)(C)C)C(C)C)C(=O)NCc1ccccn1
: