Target
Cytosol aminopeptidase
Ligand
BDBM50024590
Substrate
Meas. Tech.
ChEMBL_98405 (CHEMBL706602)
Ki
470±n/a nM
Citation
 Giannousis, PPBartlett, PA Phosphorus amino acid analogues as inhibitors of leucine aminopeptidase. J Med Chem 30:1603-9 (1987)  
Target
Name:
Cytosol aminopeptidase
Synonyms:
AMPL_HUMAN LAP3 Leucine aminopeptidase | PEPS
Type:
PROTEIN
Mol. Mass.:
56171.75
Organism:
Homo sapiens (Human)
Description:
ChEMBL_1507539
Residue:
519
  
Inhibitor
Name:
BDBM50024590
Synonyms:
1-Ammonium-octane-1-phosphonic acid anion | CHEMBL38475
Type:
Small organic molecule
Emp. Form.:
C8H20NO3P
Mol. Mass.:
209.2231
SMILES:
CCCCCCCC([NH3+])P(O)([O-])=O
: