Target
Cytosol aminopeptidase
Ligand
BDBM50024592
Substrate
Meas. Tech.
ChEBML_98405
Ki
15400±n/a nM
Citation
 Giannousis, PPBartlett, PA Phosphorus amino acid analogues as inhibitors of leucine aminopeptidase. J Med Chem 30:1603-9 (1987)  
Target
Name:
Cytosol aminopeptidase
Synonyms:
AMPL_HUMAN LAP3 Leucine aminopeptidase | PEPS
Type:
PROTEIN
Mol. Mass.:
56171.75
Organism:
Homo sapiens (Human)
Description:
ChEMBL_1507539
Residue:
519
  
Inhibitor
Name:
BDBM50024592
Synonyms:
(S)-1-Ammonium-2-phenyl-ethanephosphonic acid anion | CHEMBL289264
Type:
Small organic molecule
Emp. Form.:
C8H12NO3P
Mol. Mass.:
201.1595
SMILES:
[NH3+][C@H](Cc1ccccc1)P(O)([O-])=O
: