Target
Cytosol aminopeptidase
Ligand
BDBM50017377
Substrate
Meas. Tech.
ChEBML_98405
Ki
240000±n/a nM
Citation
 Giannousis, PPBartlett, PA Phosphorus amino acid analogues as inhibitors of leucine aminopeptidase. J Med Chem 30:1603-9 (1987)  
Target
Name:
Cytosol aminopeptidase
Synonyms:
AMPL_HUMAN LAP3 Leucine aminopeptidase | PEPS
Type:
PROTEIN
Mol. Mass.:
56171.75
Organism:
Homo sapiens (Human)
Description:
ChEMBL_1507539
Residue:
519
  
Inhibitor
Name:
BDBM50017377
Synonyms:
(1-Amino-ethyl)-phosphonic acid 1-aminoethylphosphonic acid [(1R)-1-AMINOETHYL]PHOSPHONIC ACID
Type:
Small organic molecule
Emp. Form.:
C2H8NO3P
Mol. Mass.:
125.0636
SMILES:
CC(N)P(O)(O)=O
: