Target
Cytosol aminopeptidase
Ligand
BDBM50024597
Substrate
Meas. Tech.
ChEBML_98405
Ki
220000±n/a nM
Citation
 Giannousis, PPBartlett, PA Phosphorus amino acid analogues as inhibitors of leucine aminopeptidase. J Med Chem 30:1603-9 (1987)  
Target
Name:
Cytosol aminopeptidase
Synonyms:
AMPL_HUMAN LAP3 Leucine aminopeptidase | PEPS
Type:
PROTEIN
Mol. Mass.:
56171.75
Organism:
Homo sapiens (Human)
Description:
ChEMBL_1507539
Residue:
519
  
Inhibitor
Name:
BDBM50024597
Synonyms:
(S)-1-Ammonium-3-methyl-butane-1-phosphonic acid anion | CHEMBL288165
Type:
Small organic molecule
Emp. Form.:
C5H14NO3P
Mol. Mass.:
167.1433
SMILES:
CC(C)C[C@@H]([NH3+])P(O)([O-])=O
: