Target
Cytosol aminopeptidase
Ligand
BDBM50024600
Substrate
Meas. Tech.
ChEBML_98405
Ki
1650000±n/a nM
Citation
 Giannousis, PPBartlett, PA Phosphorus amino acid analogues as inhibitors of leucine aminopeptidase. J Med Chem 30:1603-9 (1987)  
Target
Name:
Cytosol aminopeptidase
Synonyms:
AMPL_HUMAN LAP3 Leucine aminopeptidase | PEPS
Type:
PROTEIN
Mol. Mass.:
56171.75
Organism:
Homo sapiens (Human)
Description:
ChEMBL_1507539
Residue:
519
  
Inhibitor
Name:
BDBM50024600
Synonyms:
2-(1-Ammonium-3-methylbutylmethoxyphosphorylcarbonylamino)-4-methyl-(2S)-pentanoate | CHEMBL43630
Type:
Small organic molecule
Emp. Form.:
C13H27N2O5P
Mol. Mass.:
322.3376
SMILES:
COP(=O)(C([NH3+])CC(C)C)C(=O)N[C@@H](CC(C)C)C([O-])=O
: