Target
Cytosol aminopeptidase
Ligand
BDBM50024599
Substrate
Meas. Tech.
ChEBML_98405
Ki
43000±n/a nM
Citation
 Giannousis, PPBartlett, PA Phosphorus amino acid analogues as inhibitors of leucine aminopeptidase. J Med Chem 30:1603-9 (1987)  
Target
Name:
Cytosol aminopeptidase
Synonyms:
AMPL_HUMAN LAP3 Leucine aminopeptidase | PEPS
Type:
PROTEIN
Mol. Mass.:
56171.75
Organism:
Homo sapiens (Human)
Description:
ChEMBL_1507539
Residue:
519
  
Inhibitor
Name:
BDBM50024599
Synonyms:
(1-Ammonium-2-phenyl-ethyl)-phosphonic acid monomethyl ester | CHEMBL296889
Type:
Small organic molecule
Emp. Form.:
C9H14NO3P
Mol. Mass.:
215.1861
SMILES:
COP([O-])(=O)C([NH3+])Cc1ccccc1
: