Target
Cytosol aminopeptidase
Ligand
BDBM50078139
Substrate
Meas. Tech.
ChEBML_98405
Ki
59000±n/a nM
Citation
 Giannousis, PPBartlett, PA Phosphorus amino acid analogues as inhibitors of leucine aminopeptidase. J Med Chem 30:1603-9 (1987)  
Target
Name:
Cytosol aminopeptidase
Synonyms:
AMPL_HUMAN LAP3 Leucine aminopeptidase | PEPS
Type:
PROTEIN
Mol. Mass.:
56171.75
Organism:
Homo sapiens (Human)
Description:
ChEMBL_1507539
Residue:
519
  
Inhibitor
Name:
BDBM50078139
Synonyms:
(1-Amino-2-phenyl-ethyl)-phosphinic acid CHEMBL37846
Type:
Small organic molecule
Emp. Form.:
C8H10NO2P
Mol. Mass.:
183.1443
SMILES:
OP(O)C(=N)Cc1ccccc1
: