Target
Cytosol aminopeptidase
Ligand
BDBM50024604
Substrate
Meas. Tech.
ChEMBL_98405 (CHEMBL706602)
Ki
3600±n/a nM
Citation
 Giannousis, PPBartlett, PA Phosphorus amino acid analogues as inhibitors of leucine aminopeptidase. J Med Chem 30:1603-9 (1987)  
Target
Name:
Cytosol aminopeptidase
Synonyms:
AMPL_HUMAN LAP3 Leucine aminopeptidase | PEPS
Type:
PROTEIN
Mol. Mass.:
56171.75
Organism:
Homo sapiens (Human)
Description:
ChEMBL_1507539
Residue:
519
  
Inhibitor
Name:
BDBM50024604
Synonyms:
1-Ammonium-propane-1-phosphonic acid anion CHEMBL289058
Type:
Small organic molecule
Emp. Form.:
C3H10NO3P
Mol. Mass.:
139.0902
SMILES:
CCC([NH3+])P(O)([O-])=O
: