Target
Cytosol aminopeptidase
Ligand
BDBM50078132
Substrate
Meas. Tech.
ChEBML_98405
Ki
87000±n/a nM
Citation
 Giannousis, PPBartlett, PA Phosphorus amino acid analogues as inhibitors of leucine aminopeptidase. J Med Chem 30:1603-9 (1987)  
Target
Name:
Cytosol aminopeptidase
Synonyms:
AMPL_HUMAN LAP3 Leucine aminopeptidase | PEPS
Type:
PROTEIN
Mol. Mass.:
56171.75
Organism:
Homo sapiens (Human)
Description:
ChEMBL_1507539
Residue:
519
  
Inhibitor
Name:
BDBM50078132
Synonyms:
(1-Amino-3-methyl-butyl)-phosphinic acid CHEMBL39768
Type:
Small organic molecule
Emp. Form.:
C5H12NO2P
Mol. Mass.:
149.128
SMILES:
CC(C)CC(=N)P(O)O
: