Target
Cytosol aminopeptidase
Ligand
BDBM50024608
Substrate
Meas. Tech.
ChEBML_98405
Ki
40000±n/a nM
Citation
 Giannousis, PPBartlett, PA Phosphorus amino acid analogues as inhibitors of leucine aminopeptidase. J Med Chem 30:1603-9 (1987)  
Target
Name:
Cytosol aminopeptidase
Synonyms:
AMPL_HUMAN LAP3 Leucine aminopeptidase | PEPS
Type:
PROTEIN
Mol. Mass.:
56171.75
Organism:
Homo sapiens (Human)
Description:
ChEMBL_1507539
Residue:
519
  
Inhibitor
Name:
BDBM50024608
Synonyms:
1-[amino({[(1S)-1-carboxylate anion-3-methylbutyl]amino}carbonyl)phosphoryl]-3-methylbutan-1-aminium | CHEMBL40965
Type:
Small organic molecule
Emp. Form.:
C12H26N3O4P
Mol. Mass.:
307.3263
SMILES:
CC(C)CC([NH3+])P(N)(=O)C(=O)N[C@@H](CC(C)C)C([O-])=O
: