Target
Cytosol aminopeptidase
Ligand
BDBM50024607
Substrate
Meas. Tech.
ChEBML_98405
Ki
340000±n/a nM
Citation
 Giannousis, PPBartlett, PA Phosphorus amino acid analogues as inhibitors of leucine aminopeptidase. J Med Chem 30:1603-9 (1987)  
Target
Name:
Cytosol aminopeptidase
Synonyms:
AMPL_HUMAN LAP3 Leucine aminopeptidase | PEPS
Type:
PROTEIN
Mol. Mass.:
56171.75
Organism:
Homo sapiens (Human)
Description:
ChEMBL_1507539
Residue:
519
  
Inhibitor
Name:
BDBM50024607
Synonyms:
2-[(1-Ammonium-2-phenyl-ethyl)-hydroxy-phosphinoyloxymethyl]-4-methyl-pentanoic acid anion
Type:
Small organic molecule
Emp. Form.:
C15H23NO5P
Mol. Mass.:
328.3211
SMILES:
CC(C)C[C@H](COP([O-])(=O)C([NH3+])Cc1ccccc1)C([O-])=O
: