Target
Leucyl-cystinyl aminopeptidase
Ligand
BDBM50017484
Substrate
Meas. Tech.
ChEMBL_35371 (CHEMBL647952)
IC50
>200000±n/a nM
Citation
 Harbeson, SLRich, DH Inhibition of aminopeptidases by peptides containing ketomethylene and hydroxyethylene amide bond replacements. J Med Chem 32:1378-92 (1989)  
Target
Name:
Leucyl-cystinyl aminopeptidase
Synonyms:
Cystinyl aminopeptidase Insulin-regulated membrane aminopeptidase Irap Leucyl-cystinyl aminopeptidase Otase P-LAP Vesicle protein of 165 kDa | Vp165
Type:
PROTEIN
Mol. Mass.:
117179.39
Organism:
Rattus norvegicus
Description:
ChEMBL_98523
Residue:
1025
  
Inhibitor
Name:
BDBM50017484
Synonyms:
5,9-Diamino-2-methyl-4-oxo-nonanoic acid | CHEMBL282212
Type:
Small organic molecule
Emp. Form.:
C10H20N2O3
Mol. Mass.:
216.2774
SMILES:
CC(CC(=O)[C@@H](N)CCCCN)C(O)=O
: