Target
Aminopeptidase B
Ligand
BDBM50017484
Substrate
Meas. Tech.
ChEBML_35354
Ki
2000±n/a nM
Citation
 Harbeson, SLRich, DH Inhibition of aminopeptidases by peptides containing ketomethylene and hydroxyethylene amide bond replacements. J Med Chem 32:1378-92 (1989)  
Target
Name:
Aminopeptidase B
Synonyms:
AMPB_RAT Arginine aminopeptidase Cytosol aminopeptidase IV | Rnpep
Type:
PROTEIN
Mol. Mass.:
72609.93
Organism:
Rattus norvegicus
Description:
ChEMBL_1344423
Residue:
650
  
Inhibitor
Name:
BDBM50017484
Synonyms:
5,9-Diamino-2-methyl-4-oxo-nonanoic acid | CHEMBL282212
Type:
Small organic molecule
Emp. Form.:
C10H20N2O3
Mol. Mass.:
216.2774
SMILES:
CC(CC(=O)[C@@H](N)CCCCN)C(O)=O
: