Target
Chymotrypsinogen A
Ligand
BDBM50014570
Substrate
Meas. Tech.
ChEBML_216617
Ki
150±n/a nM
Citation
 Angelastro, MRMehdi, SBurkhart, JPPeet, NPBey, P Alpha-diketone and alpha-keto ester derivatives of N-protected amino acids and peptides as novel inhibitors of cysteine and serine proteinases. J Med Chem 33:11-3 (1990)  
Target
Name:
Chymotrypsinogen A
Synonyms:
Alpha-chymotrypsin Chymotrypsin A Chymotrypsin A chain B Chymotrypsinogen A | alpha-Chymotrypsin (α-Chymotrypsin)
Type:
Serine protease
Mol. Mass.:
25670.88
Organism:
Bos taurus (bovine)
Description:
Residue:
245
  
Inhibitor
Name:
BDBM50014570
Synonyms:
3-Benzoylamino-2-oxo-4-phenyl-butyric acid methyl ester | CHEMBL26066
Type:
Small organic molecule
Emp. Form.:
C18H17NO4
Mol. Mass.:
311.3319
SMILES:
COC(=O)C(=O)[C@H](Cc1ccccc1)NC(=O)c1ccccc1
: