Target
3-hydroxy-3-methylglutaryl-coenzyme A reductase
Ligand
BDBM50011036
Substrate
Meas. Tech.
ChEMBL_78354 (CHEMBL691989)
IC50
25±n/a nM
Citation
 Roth, BDOrtwine, DFHoefle, MLStratton, CDSliskovic, DRWilson, MWNewton, RS Inhibitors of cholesterol biosynthesis. 1. trans-6-(2-pyrrol-1-ylethyl)-4-hydroxypyran-2-ones, a novel series of HMG-CoA reductase inhibitors. 1. Effects of structural modifications at the 2- and 5-positions of the pyrrole nucleus. J Med Chem 33:21-31 (1990)  
Target
Name:
3-hydroxy-3-methylglutaryl-coenzyme A reductase
Synonyms:
HMDH_RAT Hmgcr
Type:
Enzyme
Mol. Mass.:
96689.85
Organism:
Rattus norvegicus (rat)
Description:
Isolated rat liver microsomes were used as enzyme source.
Residue:
887
  
Inhibitor
Name:
BDBM50011036
Synonyms:
(S)-((1S,7S,8S,8aR)-8-(2-((2R,4R)-4-hydroxy-6-oxo-tetrahydro-2H-pyran-2-yl)ethyl)-7-methyl-1,2,3,7,8,8a-hexahydronaphthalen-1-yl) 2-methylbutanoate 2-Methyl-butyric acid 8-[2-(4-hydroxy-6-oxo-tetrahydro-pyran-2-yl)-ethyl]-7-methyl-1,2,3,7,8,8a-hexahydro-naphthalen-1-yl ester 2-Methyl-butyric acid 8-[2-(4-hydroxy-6-oxo-tetrahydro-pyran-2-yl)-ethyl]-7-methyl-1,2,3,7,8,8a-hexahydro-naphthalen-1-yl ester(Compactin) MEVASTATIN compactin
Type:
Small organic molecule
Emp. Form.:
C23H34O5
Mol. Mass.:
390.5131
SMILES:
CC[C@H](C)C(=O)O[C@H]1CCC=C2C=C[C@H](C)[C@H](CC[C@@H]3C[C@@H](O)CC(=O)O3)[C@@H]12
: