Target
Tubulin beta-2B chain
Ligand
BDBM50014856
Substrate
Meas. Tech.
ChEBML_211651
IC50
1400±n/a nM
Citation
 Muzaffar, ABrossi, ALin, CMHamel, E Antitubulin effects of derivatives of 3-demethylthiocolchicine, methylthio ethers of natural colchicinoids, and thioketones derived from thiocolchicine. Comparison with colchicinoids. J Med Chem 33:567-71 (1990)  
Target
Name:
Tubulin beta-2B chain
Synonyms:
TBB2B_BOVIN Tubulin | Tubulin beta chain
Type:
PROTEIN
Mol. Mass.:
49932.38
Organism:
Bos taurus
Description:
ChEMBL_211651
Residue:
445
  
Inhibitor
Name:
BDBM50014856
Synonyms:
(1,2,3,10-Tetramethoxy-9-oxo-5,6,7,9-tetrahydro-benzo[a]heptalen-7-yl)-carbamic acid butyl ester | CHEMBL152450
Type:
Small organic molecule
Emp. Form.:
C25H31NO7
Mol. Mass.:
457.5161
SMILES:
CCCCOC(=O)N[C@H]1CCc2cc(OC)c(OC)c(OC)c2-c2ccc(OC)c(=O)cc12
: