Target
Tubulin beta-2B chain
Ligand
BDBM50014858
Substrate
Meas. Tech.
ChEBML_211651
IC50
4400±n/a nM
Citation
 Muzaffar, ABrossi, ALin, CMHamel, E Antitubulin effects of derivatives of 3-demethylthiocolchicine, methylthio ethers of natural colchicinoids, and thioketones derived from thiocolchicine. Comparison with colchicinoids. J Med Chem 33:567-71 (1990)  
Target
Name:
Tubulin beta-2B chain
Synonyms:
TBB2B_BOVIN Tubulin | Tubulin beta chain
Type:
PROTEIN
Mol. Mass.:
49932.38
Organism:
Bos taurus
Description:
ChEMBL_211651
Residue:
445
  
Inhibitor
Name:
BDBM50014858
Synonyms:
Benzoic acid 7-acetylamino-1,2-dimethoxy-10-methylsulfanyl-9-oxo-5,6,7,9-tetrahydro-benzo[a]heptalen-3-yl ester | CHEMBL152554
Type:
Small organic molecule
Emp. Form.:
C28H27NO6S
Mol. Mass.:
505.582
SMILES:
COc1c(OC(=O)c2ccccc2)cc2CC[C@H](NC(C)=O)c3cc(=O)c(SC)ccc3-c2c1OC
: