Target
Tubulin beta-2B chain
Ligand
BDBM50014851
Substrate
Meas. Tech.
ChEBML_211651
IC50
1500±n/a nM
Citation
 Muzaffar, ABrossi, ALin, CMHamel, E Antitubulin effects of derivatives of 3-demethylthiocolchicine, methylthio ethers of natural colchicinoids, and thioketones derived from thiocolchicine. Comparison with colchicinoids. J Med Chem 33:567-71 (1990)  
Target
Name:
Tubulin beta-2B chain
Synonyms:
TBB2B_BOVIN Tubulin | Tubulin beta chain
Type:
PROTEIN
Mol. Mass.:
49932.38
Organism:
Bos taurus
Description:
ChEMBL_211651
Residue:
445
  
Inhibitor
Name:
BDBM50014851
Synonyms:
1N-[13-methoxy-3-methylsulfanyl-4-oxo-(6S)-4,6,7,8-tetrahydroheptaleno[1',2':4,5]benzo[d][1,3]dioxol-6-yl]acetamide( thiocornigerine) CHEMBL347323
Type:
Small organic molecule
Emp. Form.:
C21H21NO5S
Mol. Mass.:
399.46
SMILES:
COc1c2OCOc2cc2CC[C@H](NC(C)=O)c3cc(=O)c(SC)ccc3-c12
: