Target
Tubulin beta-2B chain
Ligand
BDBM50014845
Substrate
Meas. Tech.
ChEBML_211651
IC50
1300±n/a nM
Citation
 Muzaffar, ABrossi, ALin, CMHamel, E Antitubulin effects of derivatives of 3-demethylthiocolchicine, methylthio ethers of natural colchicinoids, and thioketones derived from thiocolchicine. Comparison with colchicinoids. J Med Chem 33:567-71 (1990)  
Target
Name:
Tubulin beta-2B chain
Synonyms:
TBB2B_BOVIN Tubulin | Tubulin beta chain
Type:
PROTEIN
Mol. Mass.:
49932.38
Organism:
Bos taurus
Description:
ChEMBL_211651
Residue:
445
  
Inhibitor
Name:
BDBM50014845
Synonyms:
CHEMBL351349 | Carbonic acid 7-acetylamino-1,2-dimethoxy-10-methylsulfanyl-9-oxo-5,6,7,9-tetrahydro-benzo[a]heptalen-3-yl ester ethyl ester
Type:
Small organic molecule
Emp. Form.:
C24H27NO7S
Mol. Mass.:
473.539
SMILES:
CCOC(=O)Oc1cc2CC[C@H](NC(C)=O)c3cc(=O)c(SC)ccc3-c2c(OC)c1OC
: