Target
Tubulin beta-2B chain
Ligand
BDBM50014870
Substrate
Meas. Tech.
ChEBML_211651
IC50
2000±n/a nM
Citation
 Muzaffar, ABrossi, ALin, CMHamel, E Antitubulin effects of derivatives of 3-demethylthiocolchicine, methylthio ethers of natural colchicinoids, and thioketones derived from thiocolchicine. Comparison with colchicinoids. J Med Chem 33:567-71 (1990)  
Target
Name:
Tubulin beta-2B chain
Synonyms:
TBB2B_BOVIN Tubulin | Tubulin beta chain
Type:
PROTEIN
Mol. Mass.:
49932.38
Organism:
Bos taurus
Description:
ChEMBL_211651
Residue:
445
  
Inhibitor
Name:
BDBM50014870
Synonyms:
Butyric acid 7-butyrylamino-1,2-dimethoxy-10-methylsulfanyl-9-oxo-5,6,7,9-tetrahydro-benzo[a]heptalen-3-yl ester | CHEMBL346002
Type:
Small organic molecule
Emp. Form.:
C27H33NO6S
Mol. Mass.:
499.619
SMILES:
CCCC(=O)N[C@H]1CCc2cc(OC(=O)CCC)c(OC)c(OC)c2-c2ccc(SC)c(=O)cc12
: