Target
Tubulin beta-2B chain
Ligand
BDBM50014867
Substrate
Meas. Tech.
ChEBML_211651
IC50
1700±n/a nM
Citation
 Muzaffar, ABrossi, ALin, CMHamel, E Antitubulin effects of derivatives of 3-demethylthiocolchicine, methylthio ethers of natural colchicinoids, and thioketones derived from thiocolchicine. Comparison with colchicinoids. J Med Chem 33:567-71 (1990)  
Target
Name:
Tubulin beta-2B chain
Synonyms:
TBB2B_BOVIN Tubulin | Tubulin beta chain
Type:
PROTEIN
Mol. Mass.:
49932.38
Organism:
Bos taurus
Description:
ChEMBL_211651
Residue:
445
  
Inhibitor
Name:
BDBM50014867
Synonyms:
Acetic acid 7-butyrylamino-1,2-dimethoxy-10-methylsulfanyl-9-oxo-5,6,7,9-tetrahydro-benzo[a]heptalen-3-yl ester | CHEMBL152356
Type:
Small organic molecule
Emp. Form.:
C25H29NO6S
Mol. Mass.:
471.566
SMILES:
CCCC(=O)N[C@H]1CCc2cc(OC(C)=O)c(OC)c(OC)c2-c2ccc(SC)c(=O)cc12
: