Target
Tubulin beta-2B chain
Ligand
BDBM50014871
Substrate
Meas. Tech.
ChEBML_211651
IC50
2300±n/a nM
Citation
 Muzaffar, ABrossi, ALin, CMHamel, E Antitubulin effects of derivatives of 3-demethylthiocolchicine, methylthio ethers of natural colchicinoids, and thioketones derived from thiocolchicine. Comparison with colchicinoids. J Med Chem 33:567-71 (1990)  
Target
Name:
Tubulin beta-2B chain
Synonyms:
TBB2B_BOVIN Tubulin | Tubulin beta chain
Type:
PROTEIN
Mol. Mass.:
49932.38
Organism:
Bos taurus
Description:
ChEMBL_211651
Residue:
445
  
Inhibitor
Name:
BDBM50014871
Synonyms:
3-Hydroxy-1,2-dimethoxy-7-methylamino-10-methylsulfanyl-6,7-dihydro-5H-benzo[a]heptalen-9-one | CHEMBL155335
Type:
Small organic molecule
Emp. Form.:
C20H23NO4S
Mol. Mass.:
373.466
SMILES:
CN[C@H]1CCc2cc(O)c(OC)c(OC)c2-c2ccc(SC)c(=O)cc12
: