Target
Tubulin beta-2B chain
Ligand
BDBM50009568
Substrate
Meas. Tech.
ChEBML_211651
IC50
1300±n/a nM
Citation
 Muzaffar, ABrossi, ALin, CMHamel, E Antitubulin effects of derivatives of 3-demethylthiocolchicine, methylthio ethers of natural colchicinoids, and thioketones derived from thiocolchicine. Comparison with colchicinoids. J Med Chem 33:567-71 (1990)  
Target
Name:
Tubulin beta-2B chain
Synonyms:
TBB2B_BOVIN Tubulin | Tubulin beta chain
Type:
PROTEIN
Mol. Mass.:
49932.38
Organism:
Bos taurus
Description:
ChEMBL_211651
Residue:
445
  
Inhibitor
Name:
BDBM50009568
Synonyms:
(Thiocolchicine)N-(1,2,3-Trimethoxy-10-methylsulfanyl-9-oxo-5,6,7,9-tetrahydro-benzo[a]heptalen-7-yl)-acetamide N-((S)-1,2,3-Trimethoxy-10-methylsulfanyl-9-oxo-5,6,7,9-tetrahydro-benzo[a]heptalen-7-yl)-acetamide N-(1,2,3-Trimethoxy-10-methylsulfanyl-9-oxo-5,6,7,9-tetrahydro-benzo[a]heptalen-7-yl)-acetamide (Thiocolchicine) THIOCOLCHICINE
Type:
Small organic molecule
Emp. Form.:
C22H25NO5S
Mol. Mass.:
415.503
SMILES:
COc1cc2CC[C@H](NC(C)=O)c3cc(=O)c(SC)ccc3-c2c(OC)c1OC
: