Target
Tubulin beta-2B chain
Ligand
BDBM50014861
Substrate
Meas. Tech.
ChEBML_211651
IC50
1700±n/a nM
Citation
 Muzaffar, ABrossi, ALin, CMHamel, E Antitubulin effects of derivatives of 3-demethylthiocolchicine, methylthio ethers of natural colchicinoids, and thioketones derived from thiocolchicine. Comparison with colchicinoids. J Med Chem 33:567-71 (1990)  
Target
Name:
Tubulin beta-2B chain
Synonyms:
TBB2B_BOVIN Tubulin | Tubulin beta chain
Type:
PROTEIN
Mol. Mass.:
49932.38
Organism:
Bos taurus
Description:
ChEMBL_211651
Residue:
445
  
Inhibitor
Name:
BDBM50014861
Synonyms:
CHEMBL153439 | N-(3-Hydroxy-1,2-dimethoxy-10-methylsulfanyl-9-oxo-5,6,7,9-tetrahydro-benzo[a]heptalen-7-yl)-formamide
Type:
Small organic molecule
Emp. Form.:
C20H21NO5S
Mol. Mass.:
387.449
SMILES:
COc1c(O)cc2CC[C@H](NC=O)c3cc(=O)c(SC)ccc3-c2c1OC
: