Target
Tubulin beta-2B chain
Ligand
BDBM50014877
Substrate
Meas. Tech.
ChEBML_211651
IC50
32000±n/a nM
Citation
 Muzaffar, ABrossi, ALin, CMHamel, E Antitubulin effects of derivatives of 3-demethylthiocolchicine, methylthio ethers of natural colchicinoids, and thioketones derived from thiocolchicine. Comparison with colchicinoids. J Med Chem 33:567-71 (1990)  
Target
Name:
Tubulin beta-2B chain
Synonyms:
TBB2B_BOVIN Tubulin | Tubulin beta chain
Type:
PROTEIN
Mol. Mass.:
49932.38
Organism:
Bos taurus
Description:
ChEMBL_211651
Residue:
445
  
Inhibitor
Name:
BDBM50014877
Synonyms:
7-Amino-3-hydroxy-1,2-dimethoxy-10-methylsulfanyl-6,7-dihydro-5H-benzo[a]heptalen-9-one | CHEMBL153454
Type:
Small organic molecule
Emp. Form.:
C19H21NO4S
Mol. Mass.:
359.439
SMILES:
COc1c(O)cc2CC[C@H](N)c3cc(=O)c(SC)ccc3-c2c1OC
: