Target
Dihydrofolate reductase
Ligand
BDBM50010927
Substrate
Meas. Tech.
ChEBML_53962
IC50
57±n/a nM
Citation
 Rosowsky, ABader, HFreisheim, JH Analogues of methotrexate and aminopterin with gamma-methylene and gamma-cyano substitution of the glutamate side chain: synthesis and in vitro biological activity. J Med Chem 34:203-8 (1991)  
Target
Name:
Dihydrofolate reductase
Synonyms:
DHFR Dihydrofolate reductase (DHFR) | Tetrahydrofolate dehydrogenase
Type:
Enzyme
Mol. Mass.:
21453.99
Organism:
Homo sapiens (Human)
Description:
Recombinant human DHFR.
Residue:
187
  
Inhibitor
Name:
BDBM50010927
Synonyms:
2-Cyano-4-{4-[(2,4-diamino-pteridin-6-ylmethyl)-methyl-amino]-benzoylamino}-pentanedioic acid | CHEMBL65620
Type:
Small organic molecule
Emp. Form.:
C21H21N9O5
Mol. Mass.:
479.4487
SMILES:
CN(Cc1cnc2nc(N)nc(N)c2n1)c1ccc(cc1)C(=O)NC(CC(C#N)C(O)=O)C(O)=O
: