Target
Adenosine receptor A1
Ligand
BDBM50009688
Substrate
Meas. Tech.
ChEBML_29468
Ki
2800±n/a nM
Citation
 Thompson, RDSecunda, SDaly, JWOlsson, RA N6,9-disubstituted adenines: potent, selective antagonists at the A1 adenosine receptor. J Med Chem 34:2877-82 (1991)  
Target
Name:
Adenosine receptor A1
Synonyms:
AA1R_RAT ADENOSINE A1 high Adenosine A1 receptor (A1) Adenosine receptors A1 | Adora1
Type:
Protein
Mol. Mass.:
36704.13
Organism:
Rattus norvegicus (rat)
Description:
Residue:
326
  
Inhibitor
Name:
BDBM50009688
Synonyms:
(2-Chloro-9-methyl-9H-purin-6-yl)-(1-phenyl-propyl)-amine | CHEMBL99407
Type:
Small organic molecule
Emp. Form.:
C15H16ClN5
Mol. Mass.:
301.774
SMILES:
CC[C@H](Nc1nc(Cl)nc2n(C)cnc12)c1ccccc1
: