Target
Kappa-type opioid receptor
Ligand
BDBM50001054
Substrate
Meas. Tech.
ChEMBL_146667 (CHEMBL755870)
Ki
1.5±n/a nM
Citation
 de Costa, BRIadarola, MJRothman, RBBerman, KFGeorge, CNewman, AHMahboubi, AJacobson, AERice, KC Probes for narcotic receptor mediated phenomena. 18. Epimeric 6 alpha- and 6 beta-iodo-3,14-dihydroxy-17-(cyclopropylmethyl)-4,5 alpha-epoxymorphinans as potential ligands for opioid receptor single photon emission computed tomography: synthesis, evaluation, and radiochemistry of [125I]-6 beta-iodo J Med Chem 35:2826-35 (1992)  
Target
Name:
Kappa-type opioid receptor
Synonyms:
Kappa Opioid Receptor OPRK1 Opiate Kappa 1 | mu/kappa opioid receptor
Type:
G Protein-Coupled Receptor (GPCR)
Mol. Mass.:
42744.99
Organism:
Cavia porcellus (domestic guinea pig)
Description:
P41144
Residue:
380
  
Inhibitor
Name:
BDBM50001054
Synonyms:
4-cyclopropylmethyl-14-iodo-(14R,17S)-12-oxa-4-azapentacyclo[9.6.1.01,13.05,17.07,18]octadeca-7(18),8,10-triene-10,17-diol(ioxy)
Type:
Small organic molecule
Emp. Form.:
C20H24INO3
Mol. Mass.:
453.3139
SMILES:
Oc1ccc2CC3N(CC4CC4)CC[C@@]45[C@@H](Oc1c24)[C@H](I)CC[C@@]35O
: