Target
Neuropeptide Y receptor type 1
Ligand
BDBM50003050
Substrate
Meas. Tech.
ChEBML_143821
Kd
>1000±n/a nM
Citation
 Reymond, MTDelmas, LKoerber, SCBrown, MRRivier, JE Truncated, branched, and/or cyclic analogues of neuropeptide Y: importance of the pancreatic peptide fold in the design of specific Y2 receptor ligands. J Med Chem 35:3653-9 (1992)  
Target
Name:
Neuropeptide Y receptor type 1
Synonyms:
NPY-Y1 NPY1R NPYR neuropeptide Y receptor Y1
Type:
Enzyme Catalytic Domain
Mol. Mass.:
44399.07
Organism:
Homo sapiens (Human)
Description:
NPY-Y1 NPY1R HUMAN::P25929
Residue:
384
  
Inhibitor
Name:
BDBM50003050
Synonyms:
CHEMBL407742 | c(1,30)Glu-Pro-Ala-Tyr-Ile-Asn-Dpr-Ile-Thr-Arg-Gln-Arg-Tyr
Type:
Small organic molecule
Emp. Form.:
C71H111N23O19
Mol. Mass.:
1590.7837
SMILES:
CC[C@H](C)[C@H](NC(=O)[C@@]1(C)NC(=O)CC[C@@H](N)C(=O)N2CCC[C@@H]2C(=O)N[C@@H](C)C(=O)N[C@H](Cc2ccc(O)cc2)C(=O)N[C@@H]([C@@H](C)CC)C(=O)N[C@H](CC(N)=O)C(=O)N1)C(=O)N[C@@H]([C@@H](C)O)C(=O)N[C@@H](CCCNC(N)=N)C(=O)N[C@@H](CCC(N)=O)C(=O)N[C@@H](CCCNC(N)=N)C(=O)N[C@@H](Cc1ccc(O)cc1)C(N)=O
: