Target
5-hydroxytryptamine receptor 2C
Ligand
BDBM50005247
Substrate
Meas. Tech.
ChEMBL_1861 (CHEMBL616832)
Ki
2290±n/a nM
Citation
 Glennon, RARaghupathi, RBartyzel, PTeitler, MLeonhardt, S Binding of phenylalkylamine derivatives at 5-HT1C and 5-HT2 serotonin receptors: evidence for a lack of selectivity. J Med Chem 35:734-40 (1992)  
Target
Name:
5-hydroxytryptamine receptor 2C
Synonyms:
5-HT2C 5-hydroxytryptamine receptor 2C (5HT2c) 5ht1c Htr2c Serotonin receptor 2a and 2c (5HT2A and 5HT2C)
Type:
Enzyme
Mol. Mass.:
51935.10
Organism:
Rattus norvegicus (Rat)
Description:
P08909
Residue:
460
  
Inhibitor
Name:
BDBM50005247
Synonyms:
(+/-)2-Benzo[1,3]dioxol-5-yl-1-methyl-ethylamine (R)-(-)-2-Benzo[1,3]dioxol-5-yl-1-methyl-ethylamine 2-Benzo[1,3]dioxol-5-yl-1-methyl-ethylamine 3,4-methylenedioxyamphetamine MDA MDA,R(-) methylenedioxyamphetamine
Type:
Small organic molecule
Emp. Form.:
C10H13NO2
Mol. Mass.:
179.2157
SMILES:
CC(N)Cc1ccc2OCOc2c1
: