Target
Adenosine receptor A1
Ligand
BDBM50004588
Substrate
Meas. Tech.
ChEMBL_29289 (CHEMBL640350)
Ki
15±n/a nM
Citation
 Shimada, JSuzuki, FNonaka, HIshii, A 8-Polycycloalkyl-1,3-dipropylxanthines as potent and selective antagonists for A1-adenosine receptors. J Med Chem 35:924-30 (1992)  
Target
Name:
Adenosine receptor A1
Synonyms:
A1 adenosine receptor ADENOSINE A1 ADENOSINE A1 low Adenosine A1 receptor | Adenosine Receptor A1
Type:
Enzyme Catalytic Domain
Mol. Mass.:
36501.39
Organism:
GUINEA PIG
Description:
ADENOSINE A1 ADORA1 GUINEA PIG::P47745
Residue:
326
  
Inhibitor
Name:
BDBM50004588
Synonyms:
8-(Hexahydro-2,5-methano-pentalen-3a-yl)-3-isobutyl-1-methyl-3,7-dihydro-purine-2,6-dione | CHEMBL321507
Type:
Small organic molecule
Emp. Form.:
C19H26N4O2
Mol. Mass.:
342.4353
SMILES:
CC(C)Cn1c2nc([nH]c2c(=O)n(C)c1=O)C12CC3CC1CC(C2)C3
: