Target
Adenosine receptor A1
Ligand
BDBM50368574
Substrate
Meas. Tech.
ChEBML_29292
Ki
0.750000±n/a nM
Citation
 Shimada, JSuzuki, FNonaka, HIshii, A 8-Polycycloalkyl-1,3-dipropylxanthines as potent and selective antagonists for A1-adenosine receptors. J Med Chem 35:924-30 (1992)  
Target
Name:
Adenosine receptor A1
Synonyms:
A1 adenosine receptor ADENOSINE A1 ADENOSINE A1 low Adenosine A1 receptor | Adenosine Receptor A1
Type:
Enzyme Catalytic Domain
Mol. Mass.:
36501.39
Organism:
GUINEA PIG
Description:
ADENOSINE A1 ADORA1 GUINEA PIG::P47745
Residue:
326
  
Inhibitor
Name:
BDBM50368574
Synonyms:
CHEMBL605440
Type:
Small organic molecule
Emp. Form.:
C15H23N5O4
Mol. Mass.:
337.3742
SMILES:
CCC(CC)Nc1ncnc2n(cnc12)C1O[C@H](CO)[C@@H](O)[C@H]1O
: