Target
Adenosine receptor A1
Ligand
BDBM50005379
Substrate
Meas. Tech.
ChEMBL_29004 (CHEMBL643478)
Ki
82±n/a nM
Citation
 Shimada, JSuzuki, FNonaka, HIshii, A 8-Polycycloalkyl-1,3-dipropylxanthines as potent and selective antagonists for A1-adenosine receptors. J Med Chem 35:924-30 (1992)  
Target
Name:
Adenosine receptor A1
Synonyms:
AA1R_RAT ADENOSINE A1 high Adenosine A1 receptor (A1) Adenosine receptors A1 | Adora1
Type:
Protein
Mol. Mass.:
36704.13
Organism:
Rattus norvegicus (rat)
Description:
Residue:
326
  
Inhibitor
Name:
BDBM50005379
Synonyms:
8-Adamantan-1-yl-1,3-dipropyl-3,7-dihydro-purine-2,6-dione | CHEMBL369602
Type:
Small organic molecule
Emp. Form.:
C21H30N4O2
Mol. Mass.:
370.4885
SMILES:
CCCn1c2nc([nH]c2c(=O)n(CCC)c1=O)C12C[C@H]3C[C@H](C[C@H](C3)C1)C2
: