Target
Adenosine receptor A1
Ligand
BDBM50421997
Substrate
Meas. Tech.
ChEMBL_29289 (CHEMBL640350)
Ki
0.800000±n/a nM
Citation
 Shimada, JSuzuki, FNonaka, HIshii, A 8-Polycycloalkyl-1,3-dipropylxanthines as potent and selective antagonists for A1-adenosine receptors. J Med Chem 35:924-30 (1992)  
Target
Name:
Adenosine receptor A1
Synonyms:
A1 adenosine receptor ADENOSINE A1 ADENOSINE A1 low Adenosine A1 receptor | Adenosine Receptor A1
Type:
Enzyme Catalytic Domain
Mol. Mass.:
36501.39
Organism:
GUINEA PIG
Description:
ADENOSINE A1 ADORA1 GUINEA PIG::P47745
Residue:
326
  
Inhibitor
Name:
BDBM50421997
Synonyms:
CHEMBL2093942
Type:
Small organic molecule
Emp. Form.:
C14H21N5O4
Mol. Mass.:
323.3476
SMILES:
CC[C@H](C)Nc1ncnc2n(cnc12)[C@@H]1O[C@H](CO)[C@@H](O)[C@H]1O
: