Target
Ryanodine receptor 1
Ligand
BDBM50044984
Substrate
Meas. Tech.
ChEBML_198268
IC50
136±n/a nM
Citation
 Gerzon, KHumerickhouse, RABesch, HRBidasee, KREmmick, JTRoeske, RWTian, ZRuest, LSutko, JL Amino- and guanidinoacylryanodines: basic ryanodine esters with enhanced affinity for the sarcoplasmic reticulum Ca(2+)-release channel. J Med Chem 36:1319-23 (1993)  
Target
Name:
Ryanodine receptor 1
Synonyms:
RYR-1 RYR1_RABIT Skeletal muscle ryanodine receptor Type 1 ryanodine receptor
Type:
PROTEIN
Mol. Mass.:
565099.26
Organism:
Oryctolagus cuniculus
Description:
ChEMBL_19634
Residue:
5037
  
Inhibitor
Name:
BDBM50044984
Synonyms:
CHEMBL416926 | Di-Benzyloxycarbonyl-guanidino acetylryanodine
Type:
Small organic molecule
Emp. Form.:
C44H52N4O14
Mol. Mass.:
860.9021
SMILES:
CC(C)C1(O)[C@@H](OC(=O)c2ccc[nH]2)C2(O)[C@@]3(C)CC4(O)OC5([C@H](OC(=O)CNC(NC(=O)OCc6ccccc6)=NC(=O)OCc6ccccc6)C(C)CCC35O)C2(O)C14C
: